{"text_format":"1","workbook":"xlsx","n_sheets":3,"sheets":["Naam invoer","Poule overzicht","Individuele resultaten"],"not_rendered":{"charts":0,"images":2,"macros":1,"external_links":0,"defined_names":2,"comments":0,"pivot_tables":0},"unopened":[],"bounds":{"document_bytes":16777216,"sheet_cells":100000,"rows_first":2000,"rows_last":500,"rows_between":2000,"halvings":0,"cell_chars":16384,"cell_head_chars":4096},"cells_cut":0,"cells_raw":0,"read":"whole","date_system":"1900"}

{"sheet":"Naam invoer","index":0,"n_rows":51,"n_cols":6,"rows_kept":51,"cut":false,"hidden":false,"merged":[[39,0,42,0],[39,1,42,1],[43,0,46,0],[43,1,46,1],[47,0,50,0],[47,1,50,1],[27,0,30,0],[27,1,30,1],[31,0,34,0],[31,1,34,1],[35,0,38,0],[35,1,38,1],[15,0,18,0],[15,1,18,1],[19,0,22,0],[19,1,22,1],[23,0,26,0],[23,1,26,1],[3,0,6,0],[3,1,6,1],[7,0,10,0],[7,1,10,1],[11,0,14,0],[11,1,14,1]]}
["Invoer deelnemende equipes"]
[]
["nr","LAND (afkorting)","namen schermers","voornaam","rang"]
[1,"KMS","Nyssens Alice","SLt"]
[null,null,"Van Bergen Nancy","Cdt"]
[null,null,"Hock Nathalie","SLt"]
[null,null,null,null,null,"reserve"]
[2,"GENT","DeGroote Ellen"]
[null,null,"Bourgeus Camille"]
[null,null,"Reijners Leanne"]
[null,null,null,null,null,"reserve"]
[3,"SWE","Holm Frida","SMJ"]
[null,null,"Persson Caroline","1 Lt"]
[null,null,"Hansson Ulrika","SGT"]
[null,null,null,null,null,"reserve"]
[4,"CAN","McRae Sarah","Capt"]
[null,null,"Gilmore Deanna","Ocdt"]
[null,null,"Laroque Kalina","Ocdt"]
[null,null,null,null,null,"reserve"]
[5,"KNAS","Tulen Carmel","CIV"]
[null,null,"Hensen Kayli","CIV"]
[null,null,"Obster Ellen","CIV"]
[null,null,null,null,null,"reserve"]
[6]
[]
[]
[null,null,null,null,null,"reserve"]
[7]
[]
[]
[null,null,null,null,null,"reserve"]
[8]
[]
[]
[null,null,null,null,null,"reserve"]
[9]
[]
[]
[null,null,null,null,null,"reserve"]
[10]
[]
[]
[null,null,null,null,null,"reserve"]
[11]
[]
[]
[null,null,null,null,null,"reserve"]
[12]
[]
[]
[null,null,null,null,null,"reserve"]

{"sheet":"Poule overzicht","index":1,"n_rows":22,"n_cols":42,"rows_kept":22,"cut":false,"hidden":false,"merged":[]}
[null,null,null,null,null,null,null,null,null,null,null,null,null,null,null,null,null,null,null,null,null,null,null,null,null,null,null,null,null,null,null,null,null,null,null,null,{"$f":"SUM(P6:T17)","v":10},"rode cijfers moeten na elke ingevulde uitslag gelijk zijn"]
[null,null,null,null,null,null,null,null,null,null,null,null,null,null,null,null,null,null,null,null,null,null,null,null,null,null,null,null,null,null,null,null,null,null,null,null,{"$f":"SUM(U6:Y17)","v":10}]
[null,null,null,"RESULTATS EQUIPES"]
[null,null,null,null,null,null,null,null,null,null,null,null,null,null,null,"MATCHES WON",null,null,null,null,null,null,null,null,null,"MATCHES LOST"]
["NR","NATION",1,2,3,4,5,6,7,8,9,10,11,12,null,"V9","V8","V7","V6","V5","D4","D3","D2","D1","D0","V9","V8","V7","V6","V5","D4","D3","D2","D1","D0",null,"VICTOIRES","MATCHES GAGNES","MATCHES PERDUS","INDICES","RANKING"]
[1,{"$f":"IF('Naam invoer'!B4=\"\",\"\",'Naam invoer'!B4)","v":"KMS"},null,"v5","v5","v5","d2",null,null,null,null,null,null,null,null,{"$f":"COUNTIF(C6:N6,\"V9\")","v":0},{"$f":"COUNTIF(C6:N6,\"V8\")","v":0},{"$f":"COUNTIF(C6:N6,\"V7\")","v":0},{"$f":"COUNTIF(C6:N6,\"V6\")","v":0},{"$f":"COUNTIF(C6:N6,\"V5\")","v":3},{"$f":"COUNTIF(C6:N6,\"D4\")","v":0},{"$f":"COUNTIF(C6:N6,\"D3\")","v":0},{"$f":"COUNTIF(C6:N6,\"D2\")","v":1},{"$f":"COUNTIF(C6:N6,\"D1\")","v":0},{"$f":"COUNTIF(C6:N6,\"D0\")","v":0},{"$f":"COUNTIF($C$6:$C$17,\"V9\")","v":0},{"$f":"COUNTIF($C$6:$C$17,\"V8\")","v":0},{"$f":"COUNTIF($C$6:$C$17,\"V7\")","v":1},{"$f":"COUNTIF($C$6:$C$17,\"V6\")","v":0},{"$f":"COUNTIF($C$6:$C$17,\"V5\")","v":0},{"$f":"COUNTIF($C$6:$C$17,\"D4\")","v":3},{"$f":"COUNTIF($C$6:$C$17,\"D3\")","v":0},{"$f":"COUNTIF($C$6:$C$17,\"D2\")","v":0},{"$f":"COUNTIF($C$6:$C$17,\"D1\")","v":0},{"$f":"COUNTIF($C$6:$C$17,\"D0\")","v":0},{"$f":"SUM(O6:Y6)","v":4},{"$f":"SUM(P6:T6)","v":3},{"$f":"(P6*9)+(Q6*8)+(R6*7)+(S6*6)+(T6*5)+(U6*4)+(V6*3)+(W6*2)+(X6*1)","v":17},{"$f":"(Z6*9)+(AA6*8)+(AB6*7)+(AC6*6)+(AD6*5)+(AE6*4)+(AF6*3)+(AG6*2)+(AH6*1)","v":19},{"$f":"AL6-AM6","v":-2},{"$f":"IF(AP6=\"\",\"\",AP6)","v":2},{"$f":"IF(AJ6=0,\"\",2)","v":2}]
[2,{"$f":"IF('Naam invoer'!B8=\"\",\"\",'Naam invoer'!B8)","v":"GENT"},"d4",null,"v5","d4","d2",null,null,null,null,null,null,null,null,0,0,0,0,1,2,0,1,0,0,{"$f":"COUNTIF($D$6:$D$17,\"V9\")","v":0},{"$f":"COUNTIF($D$6:$D$17,\"V8\")","v":0},{"$f":"COUNTIF($D$6:$D$17,\"V7\")","v":1},{"$f":"COUNTIF($D$6:$D$17,\"V6\")","v":0},{"$f":"COUNTIF($D$6:$D$17,\"V5\")","v":2},{"$f":"COUNTIF($D$6:$D$17,\"D4\")","v":1},{"$f":"COUNTIF($D$6:$D$17,\"D3\")","v":0},{"$f":"COUNTIF($D$6:$D$17,\"D2\")","v":0},{"$f":"COUNTIF($D$6:$D$17,\"D1\")","v":0},{"$f":"COUNTIF($D$6:$D$17,\"D0\")","v":0},4,1,15,21,-6,3,{"$f":"IF(AJ7=0,\"\",3)","v":3}]
[3,{"$f":"IF('Naam invoer'!B12=\"\",\"\",'Naam invoer'!B12)","v":"SWE"},"d4","d4",null,"v7","d0",null,null,null,null,null,null,null,null,0,0,1,0,0,2,0,0,0,1,{"$f":"COUNTIF($E$6:$E$17,\"V9\")","v":1},{"$f":"COUNTIF($E$6:$E$17,\"V8\")","v":0},{"$f":"COUNTIF($E$6:$E$17,\"V7\")","v":0},{"$f":"COUNTIF($E$6:$E$17,\"V6\")","v":0},{"$f":"COUNTIF($E$6:$E$17,\"V5\")","v":2},{"$f":"COUNTIF($E$6:$E$17,\"D4\")","v":0},{"$f":"COUNTIF($E$6:$E$17,\"D3\")","v":0},{"$f":"COUNTIF($E$6:$E$17,\"D2\")","v":1},{"$f":"COUNTIF($E$6:$E$17,\"D1\")","v":0},{"$f":"COUNTIF($E$6:$E$17,\"D0\")","v":0},4,1,15,21,-6,4,{"$f":"IF(AJ8=0,\"\",4)","v":4}]
[4,{"$f":"IF('Naam invoer'!B16=\"\",\"\",'Naam invoer'!B16)","v":"CAN"},"d4","v5","d2",null,"d1",null,null,null,null,null,null,null,null,0,0,0,0,1,1,0,1,1,0,{"$f":"COUNTIF($F$6:$F$17,\"V9\")","v":0},{"$f":"COUNTIF($F$6:$F$17,\"V8\")","v":1},{"$f":"COUNTIF($F$6:$F$17,\"V7\")","v":1},{"$f":"COUNTIF($F$6:$F$17,\"V6\")","v":0},{"$f":"COUNTIF($F$6:$F$17,\"V5\")","v":1},{"$f":"COUNTIF($F$6:$F$17,\"D4\")","v":1},{"$f":"COUNTIF($F$6:$F$17,\"D3\")","v":0},{"$f":"COUNTIF($F$6:$F$17,\"D2\")","v":0},{"$f":"COUNTIF($F$6:$F$17,\"D1\")","v":0},{"$f":"COUNTIF($F$6:$F$17,\"D0\")","v":0},4,1,12,24,-12,5,{"$f":"IF(AJ9=0,\"\",5)","v":5}]
[5,{"$f":"IF('Naam invoer'!B20=\"\",\"\",'Naam invoer'!B20)","v":"KNAS"},"v7","v7","v9","v8",null,null,null,null,null,null,null,null,null,1,1,2,0,0,0,0,0,0,0,{"$f":"COUNTIF($G$6:$G$17,\"V9\")","v":0},{"$f":"COUNTIF($G$6:$G$17,\"V8\")","v":0},{"$f":"COUNTIF($G$6:$G$17,\"V7\")","v":0},{"$f":"COUNTIF($G$6:$G$17,\"V6\")","v":0},{"$f":"COUNTIF($G$6:$G$17,\"V5\")","v":0},{"$f":"COUNTIF($G$6:$G$17,\"D4\")","v":0},{"$f":"COUNTIF($G$6:$G$17,\"D3\")","v":0},{"$f":"COUNTIF($G$6:$G$17,\"D2\")","v":2},{"$f":"COUNTIF($G$6:$G$17,\"D1\")","v":1},{"$f":"COUNTIF($G$6:$G$17,\"D0\")","v":1},4,4,31,5,26,1,{"$f":"IF(AJ10=0,\"\",1)","v":1}]
[6,{"$f":"IF('Naam invoer'!B24=\"\",\"\",'Naam invoer'!B24)","v":""},null,null,null,null,null,null,null,null,null,null,null,null,null,0,0,0,0,0,0,0,0,0,0,{"$f":"COUNTIF($H$6:$H$17,\"V9\")","v":0},{"$f":"COUNTIF($H$6:$H$17,\"V8\")","v":0},{"$f":"COUNTIF($H$6:$H$17,\"V7\")","v":0},{"$f":"COUNTIF($H$6:$H$17,\"V6\")","v":0},{"$f":"COUNTIF($H$6:$H$17,\"V5\")","v":0},{"$f":"COUNTIF($H$6:$H$17,\"D4\")","v":0},{"$f":"COUNTIF($H$6:$H$17,\"D3\")","v":0},{"$f":"COUNTIF($H$6:$H$17,\"D2\")","v":0},{"$f":"COUNTIF($H$6:$H$17,\"D1\")","v":0},{"$f":"COUNTIF($H$6:$H$17,\"D0\")","v":0},0,0,0,0,0,"",{"$f":"IF(AJ11=0,\"\",6)","v":""}]
[7,{"$f":"IF('Naam invoer'!B28=\"\",\"\",'Naam invoer'!B28)","v":""},null,null,null,null,null,null,null,null,null,null,null,null,null,0,0,0,0,0,0,0,0,0,0,{"$f":"COUNTIF($I$6:$I$17,\"V9\")","v":0},{"$f":"COUNTIF($I$6:$I$17,\"V8\")","v":0},{"$f":"COUNTIF($I$6:$I$17,\"V7\")","v":0},{"$f":"COUNTIF($I$6:$I$17,\"V6\")","v":0},{"$f":"COUNTIF($I$6:$I$17,\"V5\")","v":0},{"$f":"COUNTIF($I$6:$I$17,\"D4\")","v":0},{"$f":"COUNTIF($I$6:$I$17,\"D3\")","v":0},{"$f":"COUNTIF($I$6:$I$17,\"D2\")","v":0},{"$f":"COUNTIF($I$6:$I$17,\"D1\")","v":0},{"$f":"COUNTIF($I$6:$I$17,\"D0\")","v":0},0,0,0,0,0,"",{"$f":"IF(AJ12=0,\"\",7)","v":""}]
[8,{"$f":"IF('Naam invoer'!B32=\"\",\"\",'Naam invoer'!B32)","v":""},null,null,null,null,null,null,null,null,null,null,null,null,null,0,0,0,0,0,0,0,0,0,0,{"$f":"COUNTIF($J$6:$J$17,\"V9\")","v":0},{"$f":"COUNTIF($J$6:$J$17,\"V8\")","v":0},{"$f":"COUNTIF($J$6:$J$17,\"V7\")","v":0},{"$f":"COUNTIF($J$6:$J$17,\"V6\")","v":0},{"$f":"COUNTIF($J$6:$J$17,\"V5\")","v":0},{"$f":"COUNTIF($J$6:$J$17,\"D4\")","v":0},{"$f":"COUNTIF($J$6:$J$17,\"D3\")","v":0},{"$f":"COUNTIF($J$6:$J$17,\"D2\")","v":0},{"$f":"COUNTIF($J$6:$J$17,\"D1\")","v":0},{"$f":"COUNTIF($J$6:$J$17,\"D0\")","v":0},0,0,0,0,0,"",{"$f":"IF(AJ13=0,\"\",8)","v":""}]
[9,{"$f":"IF('Naam invoer'!B36=\"\",\"\",'Naam invoer'!B36)","v":""},null,null,null,null,null,null,null,null,null,null,null,null,null,0,0,0,0,0,0,0,0,0,0,{"$f":"COUNTIF($K$6:$K$17,\"V9\")","v":0},{"$f":"COUNTIF($K$6:$K$17,\"V8\")","v":0},{"$f":"COUNTIF($K$6:$K$17,\"V7\")","v":0},{"$f":"COUNTIF($K$6:$K$17,\"V6\")","v":0},{"$f":"COUNTIF($K$6:$K$17,\"V5\")","v":0},{"$f":"COUNTIF($K$6:$K$17,\"D4\")","v":0},{"$f":"COUNTIF($K$6:$K$17,\"D3\")","v":0},{"$f":"COUNTIF($K$6:$K$17,\"D2\")","v":0},{"$f":"COUNTIF($K$6:$K$17,\"D1\")","v":0},{"$f":"COUNTIF($K$6:$K$17,\"D0\")","v":0},0,0,0,0,0,"",{"$f":"IF(AJ14=0,\"\",9)","v":""}]
[10,{"$f":"IF('Naam invoer'!B40=\"\",\"\",'Naam invoer'!B40)","v":""},null,null,null,null,null,null,null,null,null,null,null,null,null,0,0,0,0,0,0,0,0,0,0,{"$f":"COUNTIF($L$6:$L$17,\"V9\")","v":0},{"$f":"COUNTIF($L$6:$L$17,\"V8\")","v":0},{"$f":"COUNTIF($L$6:$L$17,\"V7\")","v":0},{"$f":"COUNTIF($L$6:$L$17,\"V6\")","v":0},{"$f":"COUNTIF($L$6:$L$17,\"V5\")","v":0},{"$f":"COUNTIF($L$6:$L$17,\"D4\")","v":0},{"$f":"COUNTIF($L$6:$L$17,\"D3\")","v":0},{"$f":"COUNTIF($L$6:$L$17,\"D2\")","v":0},{"$f":"COUNTIF($L$6:$L$17,\"D1\")","v":0},{"$f":"COUNTIF($L$6:$L$17,\"D0\")","v":0},0,0,0,0,0,"",{"$f":"IF(AJ15=0,\"\",10)","v":""}]
[11,{"$f":"IF('Naam invoer'!B44=\"\",\"\",'Naam invoer'!B44)","v":""},null,null,null,null,null,null,null,null,null,null,null,null,null,0,0,0,0,0,0,0,0,0,0,{"$f":"COUNTIF($M$6:$M$17,\"V9\")","v":0},{"$f":"COUNTIF($M$6:$M$17,\"V8\")","v":0},{"$f":"COUNTIF($M$6:$M$17,\"V7\")","v":0},{"$f":"COUNTIF($M$6:$M$17,\"V6\")","v":0},{"$f":"COUNTIF($M$6:$M$17,\"V5\")","v":0},{"$f":"COUNTIF($M$6:$M$17,\"D4\")","v":0},{"$f":"COUNTIF($M$6:$M$17,\"D3\")","v":0},{"$f":"COUNTIF($M$6:$M$17,\"D2\")","v":0},{"$f":"COUNTIF($M$6:$M$17,\"D1\")","v":0},{"$f":"COUNTIF($M$6:$M$17,\"D0\")","v":0},0,0,0,0,0,"",{"$f":"IF(AJ16=0,\"\",11)","v":""}]
[12,{"$f":"IF('Naam invoer'!B48=\"\",\"\",'Naam invoer'!B48)","v":""},null,null,null,null,null,null,null,null,null,null,null,null,null,0,0,0,0,0,0,0,0,0,0,{"$f":"COUNTIF($N$6:$N$17,\"V9\")","v":0},{"$f":"COUNTIF($N$6:$N$17,\"V8\")","v":0},{"$f":"COUNTIF($N$6:$N$17,\"V7\")","v":0},{"$f":"COUNTIF($N$6:$N$17,\"V6\")","v":0},{"$f":"COUNTIF($N$6:$N$17,\"V5\")","v":0},{"$f":"COUNTIF($N$6:$N$17,\"D4\")","v":0},{"$f":"COUNTIF($N$6:$N$17,\"D3\")","v":0},{"$f":"COUNTIF($N$6:$N$17,\"D2\")","v":0},{"$f":"COUNTIF($N$6:$N$17,\"D1\")","v":0},{"$f":"COUNTIF($N$6:$N$17,\"D0\")","v":0},0,0,0,0,0,"",{"$f":"IF(AJ17=0,\"\",12)","v":""}]
[]
["In te vullen waarden: V9, V8, V7, V6, V5, D4, D3, D2, D1 en D0.",null,null,null,null,null,null,null,null,null,null,null,null,null,null,null,null,null,null,null,null,null,null,null,null,null,null,null,null,null,null,null,null,null,null,null,{"$f":"SUM(AK6:AK17)","v":10},{"$f":"SUM(AL6:AL17)","v":90},{"$f":"SUM(AM6:AM17)","v":90},{"$f":"SUM(AN6:AN17)","v":0}]
["Geen spaties gebruiken"]
[]
["Voor einduitslag type Ctrl e"]

{"sheet":"Individuele resultaten","index":2,"n_rows":57,"n_cols":72,"rows_kept":57,"cut":false,"hidden":false,"merged":[[2,59,2,63],[0,21,0,22],[0,23,0,24]]}
[null,null,null,null,null,null,null,null,null,null,null,null,null,null,null,null,null,null,null,null,null,{"$f":"SUM(BC5:BL52)/2","v":90},null,{"$f":"COUNTIF($F$5:$BA$52,\"4\")+COUNTIF($F$5:$BA$52,\"3\")+COUNTIF($F$5:$BA$52,\"2\")+COUNTIF($F$5:$BA$52,\"1 \")+COUNTIF($F$5:$BA$52,\"0\")","v":90},null,"rode cijfers moeten na elke ingevulde uitslag gelijk zijn",null,null,null,null,null,null,null,null,null,null,null,null,null,null,null,null,null,null,null,null,null,null,null,null,null,null,null,null,null,null,null,null,null,null,null,null,null,null,null,{"$f":"SUM(BC5:BL52)/2","v":90},{"$f":"COUNTIF($F$5:$BA$52,\"4\")+COUNTIF($F$5:$BA$52,\"3\")+COUNTIF($F$5:$BA$52,\"2\")+COUNTIF($F$5:$BA$52,\"1 \")+COUNTIF($F$5:$BA$52,\"0\")","v":90}]
[null,null,null,null,"RESULTATS INDIVIDUELS"]
[null,null,null,null,null,null,null,null,null,null,null,null,null,null,null,null,null,null,null,null,null,null,null,null,null,null,null,null,null,null,null,null,null,null,null,null,null,null,null,null,null,null,null,null,null,null,null,null,null,null,null,null,null,null,"TD",null,null,null,null,"TR"]
["NR","RNK","NAME","FIRST NAME","NAT.",1,2,3,4,5,6,7,8,9,10,11,12,13,14,15,16,17,18,19,20,21,22,23,24,25,26,27,28,29,30,31,32,33,34,35,36,37,38,39,40,41,42,43,44,45,46,47,48,null,"v","v4","v3","v2","v1","v","v4","v3","v2","v1",null,"V","TD","TR","I","RANKING"]
[1,{"$f":"IF('Naam invoer'!E4=\"\",\"\",'Naam invoer'!E4)","v":""},{"$f":"IF('Naam invoer'!C4=\"\",\"\",'Naam invoer'!C4)","v":"Nyssens Alice"},{"$f":"IF('Naam invoer'!D4=\"\",\"\",'Naam invoer'!D4)","v":"SLt"},{"$f":"IF('Naam invoer'!B4=\"\",\"\",'Naam invoer'!B4)","v":"KMS"},null,null,null,null,"V","V","V4",null,"V4","V",4,null,"V","V","V",null,4,4,"V",null,null,null,null,null,null,null,null,null,null,null,null,null,null,null,null,null,null,null,null,null,null,null,null,null,null,null,null,null,null,{"$f":"COUNTIF(F5:BA5,\"v\")","v":7},{"$f":"COUNTIF(F5:BA5,\"v4\")","v":2},{"$f":"COUNTIF(F5:BA5,\"v3\")","v":0},{"$f":"COUNTIF(F5:BA5,\"v2\")","v":0},{"$f":"COUNTIF(F5:BA5,\"v1\")","v":0},{"$f":"COUNTIF($F$5:$F$52,\"v\")","v":3},{"$f":"COUNTIF($F$5:$F$52,\"v4\")","v":0},{"$f":"COUNTIF($F$5:$F$52,\"v3\")","v":0},{"$f":"COUNTIF($F$5:$F$52,\"v2\")","v":0},{"$f":"COUNTIF($F$5:$F$52,\"v1\")","v":0},{"$f":"SUM(BC5:BL5)","v":12},{"$f":"SUM(BC5:BG5)","v":9},{"$f":"(BC5*5)+(BD5*4)+(BE5*3)+(BF5*2)+(BG5*1)+SUM(F5:BA5)","v":55},{"$f":"(BH5*5)+(BI5*4)+(BJ5*3)+(BK5*2)+(BL5*1)+SUM(F$5:F$52)","v":29},{"$f":"BO5-BP5","v":26},{"$f":"IF(BS5=\"\",\"\",BS5)","v":4},{"$f":"IF(BM5=0,\"\",4)","v":4},{"$f":"BS5","v":4}]
[2,{"$f":"IF('Naam invoer'!E5=\"\",\"\",'Naam invoer'!E5)","v":""},{"$f":"IF('Naam invoer'!C5=\"\",\"\",'Naam invoer'!C5)","v":"Van Bergen Nancy"},{"$f":"IF('Naam invoer'!D5=\"\",\"\",'Naam invoer'!D5)","v":"Cdt"},{"$f":"IF('Naam invoer'!$B$4=\"\",\"\",'Naam invoer'!$B$4)","v":"KMS"},null,null,null,null,"V",4,3,null,2,1,4,null,3,2,2,null,2,"V",3,null,null,null,null,null,null,null,null,null,null,null,null,null,null,null,null,null,null,null,null,null,null,null,null,null,null,null,null,null,null,2,0,0,0,0,{"$f":"COUNTIF($G$5:$G$52,\"v\")","v":9},{"$f":"COUNTIF($G$5:$G$52,\"v4\")","v":0},{"$f":"COUNTIF($G$5:$G$52,\"v3\")","v":1},{"$f":"COUNTIF($G$5:$G$52,\"v2\")","v":0},{"$f":"COUNTIF($G$5:$G$52,\"v1\")","v":0},12,2,36,{"$f":"(BH6*5)+(BI6*4)+(BJ6*3)+(BK6*2)+(BL6*1)+SUM(G$5:G$52)","v":53},-17,13,{"$f":"IF(BM6=0,\"\",13)","v":13},13]
[3,{"$f":"IF('Naam invoer'!E6=\"\",\"\",'Naam invoer'!E6)","v":""},{"$f":"IF('Naam invoer'!C6=\"\",\"\",'Naam invoer'!C6)","v":"Hock Nathalie"},{"$f":"IF('Naam invoer'!D6=\"\",\"\",'Naam invoer'!D6)","v":"SLt"},{"$f":"IF('Naam invoer'!$B$4=\"\",\"\",'Naam invoer'!$B$4)","v":"KMS"},null,null,null,null,"V",1,4,null,"V","V","V",null,"V",4,"V",null,4,2,3,null,null,null,null,null,null,null,null,null,null,null,null,null,null,null,null,null,null,null,null,null,null,null,null,null,null,null,null,null,null,6,0,0,0,0,{"$f":"COUNTIF($H$5:$H$52,\"v\")","v":6},{"$f":"COUNTIF($H$5:$H$52,\"v4\")","v":0},{"$f":"COUNTIF($H$5:$H$52,\"v3\")","v":0},{"$f":"COUNTIF($H$5:$H$52,\"v2\")","v":0},{"$f":"COUNTIF($H$5:$H$52,\"v1\")","v":0},12,6,48,{"$f":"(BH7*5)+(BI7*4)+(BJ7*3)+(BK7*2)+(BL7*1)+SUM(H$5:H$52)","v":46},2,6,{"$f":"IF(BM7=0,\"\",6)","v":6},6]
[4,{"$f":"IF('Naam invoer'!E7=\"\",\"\",'Naam invoer'!E7)","v":""},{"$f":"IF('Naam invoer'!C7=\"\",\"\",'Naam invoer'!C7)","v":""},{"$f":"IF('Naam invoer'!D7=\"\",\"\",'Naam invoer'!D7)","v":""},{"$f":"IF('Naam invoer'!$B$4=\"\",\"\",'Naam invoer'!$B$4)","v":"KMS"},null,null,null,null,null,null,null,null,null,null,null,null,null,null,null,null,null,null,null,null,null,null,null,null,null,null,null,null,null,null,null,null,null,null,null,null,null,null,null,null,null,null,null,null,null,null,null,null,null,0,0,0,0,0,{"$f":"COUNTIF($I$5:$I$52,\"v\")","v":0},{"$f":"COUNTIF($I$5:$I$52,\"v4\")","v":0},{"$f":"COUNTIF($I$5:$I$52,\"v3\")","v":0},{"$f":"COUNTIF($I$5:$I$52,\"v2\")","v":0},{"$f":"COUNTIF($I$5:$I$52,\"v1\")","v":0},0,0,0,{"$f":"(BH8*5)+(BI8*4)+(BJ8*3)+(BK8*2)+(BL8*1)+SUM(I$5:I$52)","v":0},0,"",{"$f":"IF(BM8=0,\"\",16)","v":""},""]
[5,{"$f":"IF('Naam invoer'!E8=\"\",\"\",'Naam invoer'!E8)","v":""},{"$f":"IF('Naam invoer'!C8=\"\",\"\",'Naam invoer'!C8)","v":"DeGroote Ellen"},{"$f":"IF('Naam invoer'!D8=\"\",\"\",'Naam invoer'!D8)","v":""},{"$f":"IF('Naam invoer'!$B$8=\"\",\"\",'Naam invoer'!$B$8)","v":"GENT"},1,1,2,null,null,null,null,null,4,"V","V",null,4,1,4,null,1,1,2,null,null,null,null,null,null,null,null,null,null,null,null,null,null,null,null,null,null,null,null,null,null,null,null,null,null,null,null,null,null,2,0,0,0,0,{"$f":"COUNTIF($J$5:$J$52,\"v\")","v":10},{"$f":"COUNTIF($J$5:$J$52,\"v4\")","v":0},{"$f":"COUNTIF($J$5:$J$52,\"v3\")","v":0},{"$f":"COUNTIF($J$5:$J$52,\"v2\")","v":0},{"$f":"COUNTIF($J$5:$J$52,\"v1\")","v":0},12,2,31,{"$f":"(BH9*5)+(BI9*4)+(BJ9*3)+(BK9*2)+(BL9*1)+SUM(J$5:J$52)","v":57},-26,15,{"$f":"IF(BM9=0,\"\",15)","v":15},15]
[6,{"$f":"IF('Naam invoer'!E9=\"\",\"\",'Naam invoer'!E9)","v":""},{"$f":"IF('Naam invoer'!C9=\"\",\"\",'Naam invoer'!C9)","v":"Bourgeus Camille"},{"$f":"IF('Naam invoer'!D9=\"\",\"\",'Naam invoer'!D9)","v":""},{"$f":"IF('Naam invoer'!$B$8=\"\",\"\",'Naam invoer'!$B$8)","v":"GENT"},2,"V","V",null,null,null,null,null,"V","V","V",null,"V","V","V",null,"V",4,2,null,null,null,null,null,null,null,null,null,null,null,null,null,null,null,null,null,null,null,null,null,null,null,null,null,null,null,null,null,null,9,0,0,0,0,{"$f":"COUNTIF($K$5:$K$52,\"v\")","v":3},{"$f":"COUNTIF($K$5:$K$52,\"v4\")","v":0},{"$f":"COUNTIF($K$5:$K$52,\"v3\")","v":0},{"$f":"COUNTIF($K$5:$K$52,\"v2\")","v":0},{"$f":"COUNTIF($K$5:$K$52,\"v1\")","v":0},12,9,53,{"$f":"(BH10*5)+(BI10*4)+(BJ10*3)+(BK10*2)+(BL10*1)+SUM(K$5:K$52)","v":35},18,5,{"$f":"IF(BM10=0,\"\",5)","v":5},5]
[7,{"$f":"IF('Naam invoer'!E10=\"\",\"\",'Naam invoer'!E10)","v":""},{"$f":"IF('Naam invoer'!C10=\"\",\"\",'Naam invoer'!C10)","v":"Reijners Leanne"},{"$f":"IF('Naam invoer'!D10=\"\",\"\",'Naam invoer'!D10)","v":""},{"$f":"IF('Naam invoer'!$B$8=\"\",\"\",'Naam invoer'!$B$8)","v":"GENT"},1,"V","V",null,null,null,null,null,4,4,4,null,4,0,"V",null,0,1,"V",null,null,null,null,null,null,null,null,null,null,null,null,null,null,null,null,null,null,null,null,null,null,null,null,null,null,null,null,null,null,4,0,0,0,0,{"$f":"COUNTIF($L$5:$L$52,\"v\")","v":7},{"$f":"COUNTIF($L$5:$L$52,\"v4\")","v":1},{"$f":"COUNTIF($L$5:$L$52,\"v3\")","v":0},{"$f":"COUNTIF($L$5:$L$52,\"v2\")","v":0},{"$f":"COUNTIF($L$5:$L$52,\"v1\")","v":0},12,4,38,{"$f":"(BH11*5)+(BI11*4)+(BJ11*3)+(BK11*2)+(BL11*1)+SUM(L$5:L$52)","v":51},-13,12,{"$f":"IF(BM11=0,\"\",12)","v":12},12]
[8,{"$f":"IF('Naam invoer'!E11=\"\",\"\",'Naam invoer'!E11)","v":""},{"$f":"IF('Naam invoer'!C11=\"\",\"\",'Naam invoer'!C11)","v":""},{"$f":"IF('Naam invoer'!D11=\"\",\"\",'Naam invoer'!D11)","v":""},{"$f":"IF('Naam invoer'!$B$8=\"\",\"\",'Naam invoer'!$B$8)","v":"GENT"},null,null,null,null,null,null,null,null,null,null,null,null,null,null,null,null,null,null,null,null,null,null,null,null,null,null,null,null,null,null,null,null,null,null,null,null,null,null,null,null,null,null,null,null,null,null,null,null,null,0,0,0,0,0,{"$f":"COUNTIF($M$5:$M$52,\"v\")","v":0},{"$f":"COUNTIF($M$5:$M$52,\"v4\")","v":0},{"$f":"COUNTIF($M$5:$M$52,\"v3\")","v":0},{"$f":"COUNTIF($M$5:$M$52,\"v2\")","v":0},{"$f":"COUNTIF($M$5:$M$52,\"v1\")","v":0},0,0,0,{"$f":"(BH12*5)+(BI12*4)+(BJ12*3)+(BK12*2)+(BL12*1)+SUM(M$5:M$52)","v":0},0,"",{"$f":"IF(BM12=0,\"\",17)","v":""},""]
[9,{"$f":"IF('Naam invoer'!E12=\"\",\"\",'Naam invoer'!E12)","v":""},{"$f":"IF('Naam invoer'!C12=\"\",\"\",'Naam invoer'!C12)","v":"Holm Frida"},{"$f":"IF('Naam invoer'!D12=\"\",\"\",'Naam invoer'!D12)","v":"SMJ"},{"$f":"IF('Naam invoer'!$B$12=\"\",\"\",'Naam invoer'!$B$12)","v":"SWE"},3,"V3",3,null,"V",2,"V",null,null,null,null,null,"V","V","V3",null,1,4,1,null,null,null,null,null,null,null,null,null,null,null,null,null,null,null,null,null,null,null,null,null,null,null,null,null,null,null,null,null,null,4,0,2,0,0,{"$f":"COUNTIF($N$5:$N$52,\"v\")","v":5},{"$f":"COUNTIF($N$5:$N$52,\"v4\")","v":1},{"$f":"COUNTIF($N$5:$N$52,\"v3\")","v":0},{"$f":"COUNTIF($N$5:$N$52,\"v2\")","v":0},{"$f":"COUNTIF($N$5:$N$52,\"v1\")","v":0},12,6,40,{"$f":"(BH13*5)+(BI13*4)+(BJ13*3)+(BK13*2)+(BL13*1)+SUM(N$5:N$52)","v":45},-5,8,{"$f":"IF(BM13=0,\"\",8)","v":8},8]
[10,{"$f":"IF('Naam invoer'!E13=\"\",\"\",'Naam invoer'!E13)","v":""},{"$f":"IF('Naam invoer'!C13=\"\",\"\",'Naam invoer'!C13)","v":"Persson Caroline"},{"$f":"IF('Naam invoer'!D13=\"\",\"\",'Naam invoer'!D13)","v":"1 Lt"},{"$f":"IF('Naam invoer'!$B$12=\"\",\"\",'Naam invoer'!$B$12)","v":"SWE"},1,"V",3,null,4,2,"V",null,null,null,null,null,"V",4,"V",null,4,0,1,null,null,null,null,null,null,null,null,null,null,null,null,null,null,null,null,null,null,null,null,null,null,null,null,null,null,null,null,null,null,4,0,0,0,0,{"$f":"COUNTIF($O$5:$O$52,\"v\")","v":8},{"$f":"COUNTIF($O$5:$O$52,\"v4\")","v":0},{"$f":"COUNTIF($O$5:$O$52,\"v3\")","v":0},{"$f":"COUNTIF($O$5:$O$52,\"v2\")","v":0},{"$f":"COUNTIF($O$5:$O$52,\"v1\")","v":0},12,4,39,{"$f":"(BH14*5)+(BI14*4)+(BJ14*3)+(BK14*2)+(BL14*1)+SUM(O$5:O$52)","v":47},-8,10,{"$f":"IF(BM14=0,\"\",10)","v":10},10]
[11,{"$f":"IF('Naam invoer'!E14=\"\",\"\",'Naam invoer'!E14)","v":""},{"$f":"IF('Naam invoer'!C14=\"\",\"\",'Naam invoer'!C14)","v":"Hansson Ulrika"},{"$f":"IF('Naam invoer'!D14=\"\",\"\",'Naam invoer'!D14)","v":"SGT"},{"$f":"IF('Naam invoer'!$B$12=\"\",\"\",'Naam invoer'!$B$12)","v":"SWE"},"V","V",2,null,3,3,"V",null,null,null,null,null,"V",4,"V",null,0,4,4,null,null,null,null,null,null,null,null,null,null,null,null,null,null,null,null,null,null,null,null,null,null,null,null,null,null,null,null,null,null,5,0,0,0,0,{"$f":"COUNTIF($P$5:$P$52,\"v\")","v":7},{"$f":"COUNTIF($P$5:$P$52,\"v4\")","v":0},{"$f":"COUNTIF($P$5:$P$52,\"v3\")","v":0},{"$f":"COUNTIF($P$5:$P$52,\"v2\")","v":0},{"$f":"COUNTIF($P$5:$P$52,\"v1\")","v":0},12,5,45,{"$f":"(BH15*5)+(BI15*4)+(BJ15*3)+(BK15*2)+(BL15*1)+SUM(P$5:P$52)","v":53},-8,9,{"$f":"IF(BM15=0,\"\",9)","v":9},9]
[12,{"$f":"IF('Naam invoer'!E15=\"\",\"\",'Naam invoer'!E15)","v":""},{"$f":"IF('Naam invoer'!C15=\"\",\"\",'Naam invoer'!C15)","v":""},{"$f":"IF('Naam invoer'!D15=\"\",\"\",'Naam invoer'!D15)","v":""},{"$f":"IF('Naam invoer'!$B$12=\"\",\"\",'Naam invoer'!$B$12)","v":"SWE"},null,null,null,null,null,null,null,null,null,null,null,null,null,null,null,null,null,null,null,null,null,null,null,null,null,null,null,null,null,null,null,null,null,null,null,null,null,null,null,null,null,null,null,null,null,null,null,null,null,0,0,0,0,0,{"$f":"COUNTIF($Q$5:$Q$52,\"v\")","v":0},{"$f":"COUNTIF($Q$5:$Q$52,\"v4\")","v":0},{"$f":"COUNTIF($Q$5:$Q$52,\"v3\")","v":0},{"$f":"COUNTIF($Q$5:$Q$52,\"v2\")","v":0},{"$f":"COUNTIF($Q$5:$Q$52,\"v1\")","v":0},0,0,0,{"$f":"(BH16*5)+(BI16*4)+(BJ16*3)+(BK16*2)+(BL16*1)+SUM(Q$5:Q$52)","v":0},0,"",{"$f":"IF(BM16=0,\"\",18)","v":""},""]
[13,{"$f":"IF('Naam invoer'!E16=\"\",\"\",'Naam invoer'!E16)","v":""},{"$f":"IF('Naam invoer'!C16=\"\",\"\",'Naam invoer'!C16)","v":"McRae Sarah"},{"$f":"IF('Naam invoer'!D16=\"\",\"\",'Naam invoer'!D16)","v":"Capt"},{"$f":"IF('Naam invoer'!$B$16=\"\",\"\",'Naam invoer'!$B$16)","v":"CAN"},1,"V",2,null,"V",3,"V",null,3,1,3,null,null,null,null,null,"V",4,3,null,null,null,null,null,null,null,null,null,null,null,null,null,null,null,null,null,null,null,null,null,null,null,null,null,null,null,null,null,null,4,0,0,0,0,{"$f":"COUNTIF($R$5:$R$52,\"v\")","v":8},{"$f":"COUNTIF($R$5:$R$52,\"v4\")","v":0},{"$f":"COUNTIF($R$5:$R$52,\"v3\")","v":0},{"$f":"COUNTIF($R$5:$R$52,\"v2\")","v":0},{"$f":"COUNTIF($R$5:$R$52,\"v1\")","v":0},12,4,40,{"$f":"(BH17*5)+(BI17*4)+(BJ17*3)+(BK17*2)+(BL17*1)+SUM(R$5:R$52)","v":53},-13,11,{"$f":"IF(BM17=0,\"\",11)","v":11},11]
[14,{"$f":"IF('Naam invoer'!E17=\"\",\"\",'Naam invoer'!E17)","v":""},{"$f":"IF('Naam invoer'!C17=\"\",\"\",'Naam invoer'!C17)","v":"Gilmore Deanna"},{"$f":"IF('Naam invoer'!D17=\"\",\"\",'Naam invoer'!D17)","v":"Ocdt"},{"$f":"IF('Naam invoer'!$B$16=\"\",\"\",'Naam invoer'!$B$16)","v":"CAN"},2,"V","V",null,"V",2,"V",null,2,"V","V",null,null,null,null,null,1,2,2,null,null,null,null,null,null,null,null,null,null,null,null,null,null,null,null,null,null,null,null,null,null,null,null,null,null,null,null,null,null,6,0,0,0,0,{"$f":"COUNTIF($S$5:$S$52,\"v\")","v":6},{"$f":"COUNTIF($S$5:$S$52,\"v4\")","v":0},{"$f":"COUNTIF($S$5:$S$52,\"v3\")","v":0},{"$f":"COUNTIF($S$5:$S$52,\"v2\")","v":0},{"$f":"COUNTIF($S$5:$S$52,\"v1\")","v":0},12,6,41,{"$f":"(BH18*5)+(BI18*4)+(BJ18*3)+(BK18*2)+(BL18*1)+SUM(S$5:S$52)","v":45},-4,7,{"$f":"IF(BM18=0,\"\",7)","v":7},7]
[15,{"$f":"IF('Naam invoer'!E18=\"\",\"\",'Naam invoer'!E18)","v":""},{"$f":"IF('Naam invoer'!C18=\"\",\"\",'Naam invoer'!C18)","v":"Laroque Kalina"},{"$f":"IF('Naam invoer'!D18=\"\",\"\",'Naam invoer'!D18)","v":"Ocdt"},{"$f":"IF('Naam invoer'!$B$16=\"\",\"\",'Naam invoer'!$B$16)","v":"CAN"},0,"V",4,null,"V",1,3,null,1,1,3,null,null,null,null,null,2,2,4,null,null,null,null,null,null,null,null,null,null,null,null,null,null,null,null,null,null,null,null,null,null,null,null,null,null,null,null,null,null,2,0,0,0,0,{"$f":"COUNTIF($T$5:$T$52,\"v\")","v":9},{"$f":"COUNTIF($T$5:$T$52,\"v4\")","v":0},{"$f":"COUNTIF($T$5:$T$52,\"v3\")","v":1},{"$f":"COUNTIF($T$5:$T$52,\"v2\")","v":0},{"$f":"COUNTIF($T$5:$T$52,\"v1\")","v":0},12,2,31,{"$f":"(BH19*5)+(BI19*4)+(BJ19*3)+(BK19*2)+(BL19*1)+SUM(T$5:T$52)","v":54},-23,14,{"$f":"IF(BM19=0,\"\",14)","v":14},14]
[16,{"$f":"IF('Naam invoer'!E19=\"\",\"\",'Naam invoer'!E19)","v":""},{"$f":"IF('Naam invoer'!C19=\"\",\"\",'Naam invoer'!C19)","v":""},{"$f":"IF('Naam invoer'!D19=\"\",\"\",'Naam invoer'!D19)","v":""},{"$f":"IF('Naam invoer'!$B$16=\"\",\"\",'Naam invoer'!$B$16)","v":"CAN"},null,null,null,null,null,null,null,null,null,null,null,null,null,null,null,null,null,null,null,null,null,null,null,null,null,null,null,null,null,null,null,null,null,null,null,null,null,null,null,null,null,null,null,null,null,null,null,null,null,0,0,0,0,0,{"$f":"COUNTIF($U$5:$U$52,\"v\")","v":0},{"$f":"COUNTIF($U$5:$U$52,\"v4\")","v":0},{"$f":"COUNTIF($U$5:$U$52,\"v3\")","v":0},{"$f":"COUNTIF($U$5:$U$52,\"v2\")","v":0},{"$f":"COUNTIF($U$5:$U$52,\"v1\")","v":0},0,0,0,{"$f":"(BH20*5)+(BI20*4)+(BJ20*3)+(BK20*2)+(BL20*1)+SUM(U$5:U$52)","v":0},0,"",{"$f":"IF(BM20=0,\"\",19)","v":""},""]
[17,{"$f":"IF('Naam invoer'!E20=\"\",\"\",'Naam invoer'!E20)","v":""},{"$f":"IF('Naam invoer'!C20=\"\",\"\",'Naam invoer'!C20)","v":"Tulen Carmel"},{"$f":"IF('Naam invoer'!D20=\"\",\"\",'Naam invoer'!D20)","v":"CIV"},{"$f":"IF('Naam invoer'!$B$20=\"\",\"\",'Naam invoer'!$B$20)","v":"KNAS"},"V","V","V",null,"V",2,"V",null,"V","V","V",null,2,"V","V",null,null,null,null,null,null,null,null,null,null,null,null,null,null,null,null,null,null,null,null,null,null,null,null,null,null,null,null,null,null,null,null,null,null,10,0,0,0,0,{"$f":"COUNTIF($V$5:$V$52,\"v\")","v":2},{"$f":"COUNTIF($V$5:$V$52,\"v4\")","v":0},{"$f":"COUNTIF($V$5:$V$52,\"v3\")","v":0},{"$f":"COUNTIF($V$5:$V$52,\"v2\")","v":0},{"$f":"COUNTIF($V$5:$V$52,\"v1\")","v":0},12,10,54,{"$f":"(BH21*5)+(BI21*4)+(BJ21*3)+(BK21*2)+(BL21*1)+SUM(V$5:V$52)","v":29},25,2,{"$f":"IF(BM21=0,\"\",2)","v":2},2]
[18,{"$f":"IF('Naam invoer'!E21=\"\",\"\",'Naam invoer'!E21)","v":""},{"$f":"IF('Naam invoer'!C21=\"\",\"\",'Naam invoer'!C21)","v":"Hensen Kayli"},{"$f":"IF('Naam invoer'!D21=\"\",\"\",'Naam invoer'!D21)","v":"CIV"},{"$f":"IF('Naam invoer'!$B$20=\"\",\"\",'Naam invoer'!$B$20)","v":"KNAS"},"V",4,"V",null,"V","V","V",null,"V","V","V",null,"V","V","V",null,null,null,null,null,null,null,null,null,null,null,null,null,null,null,null,null,null,null,null,null,null,null,null,null,null,null,null,null,null,null,null,null,null,11,0,0,0,0,{"$f":"COUNTIF($W$5:$W$52,\"v\")","v":1},{"$f":"COUNTIF($W$5:$W$52,\"v4\")","v":0},{"$f":"COUNTIF($W$5:$W$52,\"v3\")","v":0},{"$f":"COUNTIF($W$5:$W$52,\"v2\")","v":0},{"$f":"COUNTIF($W$5:$W$52,\"v1\")","v":0},12,11,59,{"$f":"(BH22*5)+(BI22*4)+(BJ22*3)+(BK22*2)+(BL22*1)+SUM(W$5:W$52)","v":33},26,1,{"$f":"IF(BM22=0,\"\",1)","v":1},1]
[19,{"$f":"IF('Naam invoer'!E22=\"\",\"\",'Naam invoer'!E22)","v":""},{"$f":"IF('Naam invoer'!C22=\"\",\"\",'Naam invoer'!C22)","v":"Obster Ellen"},{"$f":"IF('Naam invoer'!D22=\"\",\"\",'Naam invoer'!D22)","v":"CIV"},{"$f":"IF('Naam invoer'!$B$20=\"\",\"\",'Naam invoer'!$B$20)","v":"KNAS"},3,"V","V",null,"V","V",2,null,"V","V","V",null,"V","V","V",null,null,null,null,null,null,null,null,null,null,null,null,null,null,null,null,null,null,null,null,null,null,null,null,null,null,null,null,null,null,null,null,null,null,10,0,0,0,0,{"$f":"COUNTIF($X$5:$X$52,\"v\")","v":2},{"$f":"COUNTIF($X$5:$X$52,\"v4\")","v":0},{"$f":"COUNTIF($X$5:$X$52,\"v3\")","v":0},{"$f":"COUNTIF($X$5:$X$52,\"v2\")","v":0},{"$f":"COUNTIF($X$5:$X$52,\"v1\")","v":0},12,10,55,{"$f":"(BH23*5)+(BI23*4)+(BJ23*3)+(BK23*2)+(BL23*1)+SUM(X$5:X$52)","v":35},20,3,{"$f":"IF(BM23=0,\"\",3)","v":3},3]
[20,{"$f":"IF('Naam invoer'!E23=\"\",\"\",'Naam invoer'!E23)","v":""},{"$f":"IF('Naam invoer'!C23=\"\",\"\",'Naam invoer'!C23)","v":""},{"$f":"IF('Naam invoer'!D23=\"\",\"\",'Naam invoer'!D23)","v":""},{"$f":"IF('Naam invoer'!$B$20=\"\",\"\",'Naam invoer'!$B$20)","v":"KNAS"},null,null,null,null,null,null,null,null,null,null,null,null,null,null,null,null,null,null,null,null,null,null,null,null,null,null,null,null,null,null,null,null,null,null,null,null,null,null,null,null,null,null,null,null,null,null,null,null,null,0,0,0,0,0,{"$f":"COUNTIF($Y$5:$Y$52,\"v\")","v":0},{"$f":"COUNTIF($Y$5:$Y$52,\"v4\")","v":0},{"$f":"COUNTIF($Y$5:$Y$52,\"v3\")","v":0},{"$f":"COUNTIF($Y$5:$Y$52,\"v2\")","v":0},{"$f":"COUNTIF($Y$5:$Y$52,\"v1\")","v":0},0,0,0,{"$f":"(BH24*5)+(BI24*4)+(BJ24*3)+(BK24*2)+(BL24*1)+SUM(Y$5:Y$52)","v":0},0,"",{"$f":"IF(BM24=0,\"\",20)","v":""},""]
[21,{"$f":"IF('Naam invoer'!E24=\"\",\"\",'Naam invoer'!E24)","v":""},{"$f":"IF('Naam invoer'!C24=\"\",\"\",'Naam invoer'!C24)","v":""},{"$f":"IF('Naam invoer'!D24=\"\",\"\",'Naam invoer'!D24)","v":""},{"$f":"IF('Naam invoer'!$B$24=\"\",\"\",'Naam invoer'!$B$24)","v":""},null,null,null,null,null,null,null,null,null,null,null,null,null,null,null,null,null,null,null,null,null,null,null,null,null,null,null,null,null,null,null,null,null,null,null,null,null,null,null,null,null,null,null,null,null,null,null,null,null,{"$f":"COUNTIF(F25:BA25,\"V\")","v":0},{"$f":"COUNTIF(F25:BA25,\"V4\")","v":0},{"$f":"COUNTIF(F25:BA25,\"V3\")","v":0},{"$f":"COUNTIF(F25:BA25,\"V2\")","v":0},{"$f":"COUNTIF(F25:BA25,\"V1\")","v":0},{"$f":"COUNTIF($Z$5:$Z$52,\"V\")","v":0},{"$f":"COUNTIF($Z$5:$Z$52,\"V4\")","v":0},{"$f":"COUNTIF($Z$5:$Z$52,\"V3\")","v":0},{"$f":"COUNTIF($Z$5:$Z$52,\"V2\")","v":0},{"$f":"COUNTIF($Z$5:$Z$52,\"V1\")","v":0},0,0,0,{"$f":"(BH25*5)+(BI25*4)+(BJ25*3)+(BK25*2)+(BL25*1)+SUM(Z$5:Z$52)","v":0},0,"",{"$f":"IF(BM25=0,\"\",21)","v":""},""]
[22,{"$f":"IF('Naam invoer'!E25=\"\",\"\",'Naam invoer'!E25)","v":""},{"$f":"IF('Naam invoer'!C25=\"\",\"\",'Naam invoer'!C25)","v":""},{"$f":"IF('Naam invoer'!D25=\"\",\"\",'Naam invoer'!D25)","v":""},{"$f":"IF('Naam invoer'!$B$24=\"\",\"\",'Naam invoer'!$B$24)","v":""},null,null,null,null,null,null,null,null,null,null,null,null,null,null,null,null,null,null,null,null,null,null,null,null,null,null,null,null,null,null,null,null,null,null,null,null,null,null,null,null,null,null,null,null,null,null,null,null,null,{"$f":"COUNTIF(F26:BA26,\"V\")","v":0},{"$f":"COUNTIF(F26:BA26,\"V4\")","v":0},{"$f":"COUNTIF(F26:BA26,\"V3\")","v":0},{"$f":"COUNTIF(F26:BA26,\"V2\")","v":0},{"$f":"COUNTIF(F26:BA26,\"V1\")","v":0},{"$f":"COUNTIF($AA$5:$AA$52,\"V\")","v":0},{"$f":"COUNTIF($AA$5:$AA$52,\"V4\")","v":0},{"$f":"COUNTIF($AA$5:$AA$52,\"V3\")","v":0},{"$f":"COUNTIF($AA$5:$AA$52,\"V2\")","v":0},{"$f":"COUNTIF($AA$5:$AA$52,\"V1\")","v":0},0,0,0,{"$f":"(BH26*5)+(BI26*4)+(BJ26*3)+(BK26*2)+(BL26*1)+SUM(AA$5:AA$52)","v":0},0,"",{"$f":"IF(BM26=0,\"\",22)","v":""},""]
[23,{"$f":"IF('Naam invoer'!E26=\"\",\"\",'Naam invoer'!E26)","v":""},{"$f":"IF('Naam invoer'!C26=\"\",\"\",'Naam invoer'!C26)","v":""},{"$f":"IF('Naam invoer'!D26=\"\",\"\",'Naam invoer'!D26)","v":""},{"$f":"IF('Naam invoer'!$B$24=\"\",\"\",'Naam invoer'!$B$24)","v":""},null,null,null,null,null,null,null,null,null,null,null,null,null,null,null,null,null,null,null,null,null,null,null,null,null,null,null,null,null,null,null,null,null,null,null,null,null,null,null,null,null,null,null,null,null,null,null,null,null,{"$f":"COUNTIF(F27:BA27,\"V\")","v":0},{"$f":"COUNTIF(F27:BA27,\"V4\")","v":0},{"$f":"COUNTIF(F27:BA27,\"V3\")","v":0},{"$f":"COUNTIF(F27:BA27,\"V2\")","v":0},{"$f":"COUNTIF(F27:BA27,\"V1\")","v":0},{"$f":"COUNTIF($AB$5:$AB$52,\"V\")","v":0},{"$f":"COUNTIF($AB$5:$AB$52,\"V4\")","v":0},{"$f":"COUNTIF($AB$5:$AB$52,\"V3\")","v":0},{"$f":"COUNTIF($AB$5:$AB$52,\"V2\")","v":0},{"$f":"COUNTIF($AB$5:$AB$52,\"V1\")","v":0},0,0,0,{"$f":"(BH27*5)+(BI27*4)+(BJ27*3)+(BK27*2)+(BL27*1)+SUM(AB$5:AB$52)","v":0},0,"",{"$f":"IF(BM27=0,\"\",23)","v":""},""]
[24,{"$f":"IF('Naam invoer'!E27=\"\",\"\",'Naam invoer'!E27)","v":""},{"$f":"IF('Naam invoer'!C27=\"\",\"\",'Naam invoer'!C27)","v":""},{"$f":"IF('Naam invoer'!D27=\"\",\"\",'Naam invoer'!D27)","v":""},{"$f":"IF('Naam invoer'!$B$24=\"\",\"\",'Naam invoer'!$B$24)","v":""},null,null,null,null,null,null,null,null,null,null,null,null,null,null,null,null,null,null,null,null,null,null,null,null,null,null,null,null,null,null,null,null,null,null,null,null,null,null,null,null,null,null,null,null,null,null,null,null,null,{"$f":"COUNTIF(F28:BA28,\"V\")","v":0},{"$f":"COUNTIF(F28:BA28,\"V4\")","v":0},{"$f":"COUNTIF(F28:BA28,\"V3\")","v":0},{"$f":"COUNTIF(F28:BA28,\"V2\")","v":0},{"$f":"COUNTIF(F28:BA28,\"V1\")","v":0},{"$f":"COUNTIF($AC$5:$AC$52,\"V\")","v":0},{"$f":"COUNTIF($AC$5:$AC$52,\"V4\")","v":0},{"$f":"COUNTIF($AC$5:$AC$52,\"V3\")","v":0},{"$f":"COUNTIF($AC$5:$AC$52,\"V2\")","v":0},{"$f":"COUNTIF($AC$5:$AC$52,\"V1\")","v":0},0,0,0,{"$f":"(BH28*5)+(BI28*4)+(BJ28*3)+(BK28*2)+(BL28*1)+SUM(AC$5:AC$52)","v":0},0,"",{"$f":"IF(BM28=0,\"\",24)","v":""},""]
[25,{"$f":"IF('Naam invoer'!E28=\"\",\"\",'Naam invoer'!E28)","v":""},{"$f":"IF('Naam invoer'!C28=\"\",\"\",'Naam invoer'!C28)","v":""},{"$f":"IF('Naam invoer'!D28=\"\",\"\",'Naam invoer'!D28)","v":""},{"$f":"IF('Naam invoer'!$B$28=\"\",\"\",'Naam invoer'!$B$28)","v":""},null,null,null,null,null,null,null,null,null,null,null,null,null,null,null,null,null,null,null,null,null,null,null,null,null,null,null,null,null,null,null,null,null,null,null,null,null,null,null,null,null,null,null,null,null,null,null,null,null,{"$f":"COUNTIF(F29:BA29,\"V\")","v":0},{"$f":"COUNTIF(F29:BA29,\"V4\")","v":0},{"$f":"COUNTIF(F29:BA29,\"V3\")","v":0},{"$f":"COUNTIF(F29:BA29,\"V2\")","v":0},{"$f":"COUNTIF(F29:BA29,\"V1\")","v":0},{"$f":"COUNTIF($AD$5:$AD$52,\"V\")","v":0},{"$f":"COUNTIF($AD$5:$AD$52,\"V4\")","v":0},{"$f":"COUNTIF($AD$5:$AD$52,\"V3\")","v":0},{"$f":"COUNTIF($AD$5:$AD$52,\"V2\")","v":0},{"$f":"COUNTIF($AD$5:$AD$52,\"V1\")","v":0},0,0,0,{"$f":"(BH29*5)+(BI29*4)+(BJ29*3)+(BK29*2)+(BL29*1)+SUM(AD$5:AD$52)","v":0},0,"",{"$f":"IF(BM29=0,\"\",25)","v":""},""]
[26,{"$f":"IF('Naam invoer'!E29=\"\",\"\",'Naam invoer'!E29)","v":""},{"$f":"IF('Naam invoer'!C29=\"\",\"\",'Naam invoer'!C29)","v":""},{"$f":"IF('Naam invoer'!D29=\"\",\"\",'Naam invoer'!D29)","v":""},{"$f":"IF('Naam invoer'!$B$28=\"\",\"\",'Naam invoer'!$B$28)","v":""},null,null,null,null,null,null,null,null,null,null,null,null,null,null,null,null,null,null,null,null,null,null,null,null,null,null,null,null,null,null,null,null,null,null,null,null,null,null,null,null,null,null,null,null,null,null,null,null,null,{"$f":"COUNTIF(F30:BA30,\"V\")","v":0},{"$f":"COUNTIF(F30:BA30,\"V4\")","v":0},{"$f":"COUNTIF(F30:BA30,\"V3\")","v":0},{"$f":"COUNTIF(F30:BA30,\"V2\")","v":0},{"$f":"COUNTIF(F30:BA30,\"V1\")","v":0},{"$f":"COUNTIF($AE$5:$AE$52,\"V\")","v":0},{"$f":"COUNTIF($AE$5:$AE$52,\"V4\")","v":0},{"$f":"COUNTIF($AE$5:$AE$52,\"V3\")","v":0},{"$f":"COUNTIF($AE$5:$AE$52,\"V2\")","v":0},{"$f":"COUNTIF($AE$5:$AE$52,\"V1\")","v":0},0,0,0,{"$f":"(BH30*5)+(BI30*4)+(BJ30*3)+(BK30*2)+(BL30*1)+SUM(AE$5:AE$52)","v":0},0,"",{"$f":"IF(BM30=0,\"\",26)","v":""},""]
[27,{"$f":"IF('Naam invoer'!E30=\"\",\"\",'Naam invoer'!E30)","v":""},{"$f":"IF('Naam invoer'!C30=\"\",\"\",'Naam invoer'!C30)","v":""},{"$f":"IF('Naam invoer'!D30=\"\",\"\",'Naam invoer'!D30)","v":""},{"$f":"IF('Naam invoer'!$B$28=\"\",\"\",'Naam invoer'!$B$28)","v":""},null,null,null,null,null,null,null,null,null,null,null,null,null,null,null,null,null,null,null,null,null,null,null,null,null,null,null,null,null,null,null,null,null,null,null,null,null,null,null,null,null,null,null,null,null,null,null,null,null,{"$f":"COUNTIF(F31:BA31,\"V\")","v":0},{"$f":"COUNTIF(F31:BA31,\"V4\")","v":0},{"$f":"COUNTIF(F31:BA31,\"V3\")","v":0},{"$f":"COUNTIF(F31:BA31,\"V2\")","v":0},{"$f":"COUNTIF(F31:BA31,\"V1\")","v":0},{"$f":"COUNTIF($AF$5:$AF$52,\"V\")","v":0},{"$f":"COUNTIF($AF$5:$AF$52,\"V4\")","v":0},{"$f":"COUNTIF($AF$5:$AF$52,\"V3\")","v":0},{"$f":"COUNTIF($AF$5:$AF$52,\"V2\")","v":0},{"$f":"COUNTIF($AF$5:$AF$52,\"V1\")","v":0},0,0,0,{"$f":"(BH31*5)+(BI31*4)+(BJ31*3)+(BK31*2)+(BL31*1)+SUM(AF$5:AF$52)","v":0},0,"",{"$f":"IF(BM31=0,\"\",27)","v":""},""]
[28,{"$f":"IF('Naam invoer'!E31=\"\",\"\",'Naam invoer'!E31)","v":""},{"$f":"IF('Naam invoer'!C31=\"\",\"\",'Naam invoer'!C31)","v":""},{"$f":"IF('Naam invoer'!D31=\"\",\"\",'Naam invoer'!D31)","v":""},{"$f":"IF('Naam invoer'!$B$28=\"\",\"\",'Naam invoer'!$B$28)","v":""},null,null,null,null,null,null,null,null,null,null,null,null,null,null,null,null,null,null,null,null,null,null,null,null,null,null,null,null,null,null,null,null,null,null,null,null,null,null,null,null,null,null,null,null,null,null,null,null,null,{"$f":"COUNTIF(F32:BA32,\"V\")","v":0},{"$f":"COUNTIF(F32:BA32,\"V4\")","v":0},{"$f":"COUNTIF(F32:BA32,\"V3\")","v":0},{"$f":"COUNTIF(F32:BA32,\"V2\")","v":0},{"$f":"COUNTIF(F32:BA32,\"V1\")","v":0},{"$f":"COUNTIF($AG$5:$AG$52,\"V\")","v":0},{"$f":"COUNTIF($AG$5:$AG$52,\"V4\")","v":0},{"$f":"COUNTIF($AG$5:$AG$52,\"V3\")","v":0},{"$f":"COUNTIF($AG$5:$AG$52,\"V2\")","v":0},{"$f":"COUNTIF($AG$5:$AG$52,\"V1\")","v":0},0,0,0,{"$f":"(BH32*5)+(BI32*4)+(BJ32*3)+(BK32*2)+(BL32*1)+SUM(AG$5:AG$52)","v":0},0,"",{"$f":"IF(BM32=0,\"\",28)","v":""},""]
[29,{"$f":"IF('Naam invoer'!E32=\"\",\"\",'Naam invoer'!E32)","v":""},{"$f":"IF('Naam invoer'!C32=\"\",\"\",'Naam invoer'!C32)","v":""},{"$f":"IF('Naam invoer'!D32=\"\",\"\",'Naam invoer'!D32)","v":""},{"$f":"IF('Naam invoer'!$B$32=\"\",\"\",'Naam invoer'!$B$32)","v":""},null,null,null,null,null,null,null,null,null,null,null,null,null,null,null,null,null,null,null,null,null,null,null,null,null,null,null,null,null,null,null,null,null,null,null,null,null,null,null,null,null,null,null,null,null,null,null,null,null,{"$f":"COUNTIF(F33:BA33,\"V\")","v":0},{"$f":"COUNTIF(F33:BA33,\"V4\")","v":0},{"$f":"COUNTIF(F33:BA33,\"V3\")","v":0},{"$f":"COUNTIF(F33:BA33,\"V2\")","v":0},{"$f":"COUNTIF(F33:BA33,\"V1\")","v":0},{"$f":"COUNTIF($AH$5:$AH$52,\"V\")","v":0},{"$f":"COUNTIF($AH$5:$AH$52,\"V4\")","v":0},{"$f":"COUNTIF($AH$5:$AH$52,\"V3\")","v":0},{"$f":"COUNTIF($AH$5:$AH$52,\"V2\")","v":0},{"$f":"COUNTIF($AH$5:$AH$52,\"V1\")","v":0},0,0,0,{"$f":"(BH33*5)+(BI33*4)+(BJ33*3)+(BK33*2)+(BL33*1)+SUM(AH$5:AH$52)","v":0},0,"",{"$f":"IF(BM33=0,\"\",29)","v":""},""]
[30,{"$f":"IF('Naam invoer'!E33=\"\",\"\",'Naam invoer'!E33)","v":""},{"$f":"IF('Naam invoer'!C33=\"\",\"\",'Naam invoer'!C33)","v":""},{"$f":"IF('Naam invoer'!D33=\"\",\"\",'Naam invoer'!D33)","v":""},{"$f":"IF('Naam invoer'!$B$32=\"\",\"\",'Naam invoer'!$B$32)","v":""},null,null,null,null,null,null,null,null,null,null,null,null,null,null,null,null,null,null,null,null,null,null,null,null,null,null,null,null,null,null,null,null,null,null,null,null,null,null,null,null,null,null,null,null,null,null,null,null,null,{"$f":"COUNTIF(F34:BA34,\"V\")","v":0},{"$f":"COUNTIF(F34:BA34,\"V4\")","v":0},{"$f":"COUNTIF(F34:BA34,\"V3\")","v":0},{"$f":"COUNTIF(F34:BA34,\"V2\")","v":0},{"$f":"COUNTIF(F34:BA34,\"V1\")","v":0},{"$f":"COUNTIF($AI$5:$AI$52,\"V\")","v":0},{"$f":"COUNTIF($AI$5:$AI$52,\"V4\")","v":0},{"$f":"COUNTIF($AI$5:$AI$52,\"V3\")","v":0},{"$f":"COUNTIF($AI$5:$AI$52,\"V2\")","v":0},{"$f":"COUNTIF($AI$5:$AI$52,\"V1\")","v":0},0,0,0,{"$f":"(BH34*5)+(BI34*4)+(BJ34*3)+(BK34*2)+(BL34*1)+SUM(AI$5:AI$52)","v":0},0,"",{"$f":"IF(BM34=0,\"\",30)","v":""},""]
[31,{"$f":"IF('Naam invoer'!E34=\"\",\"\",'Naam invoer'!E34)","v":""},{"$f":"IF('Naam invoer'!C34=\"\",\"\",'Naam invoer'!C34)","v":""},{"$f":"IF('Naam invoer'!D34=\"\",\"\",'Naam invoer'!D34)","v":""},{"$f":"IF('Naam invoer'!$B$32=\"\",\"\",'Naam invoer'!$B$32)","v":""},null,null,null,null,null,null,null,null,null,null,null,null,null,null,null,null,null,null,null,null,null,null,null,null,null,null,null,null,null,null,null,null,null,null,null,null,null,null,null,null,null,null,null,null,null,null,null,null,null,{"$f":"COUNTIF(F35:BA35,\"V\")","v":0},{"$f":"COUNTIF(F35:BA35,\"V4\")","v":0},{"$f":"COUNTIF(F35:BA35,\"V3\")","v":0},{"$f":"COUNTIF(F35:BA35,\"V2\")","v":0},{"$f":"COUNTIF(F35:BA35,\"V1\")","v":0},{"$f":"COUNTIF($AJ$5:$AJ$52,\"V\")","v":0},{"$f":"COUNTIF($AJ$5:$AJ$52,\"V4\")","v":0},{"$f":"COUNTIF($AJ$5:$AJ$52,\"V3\")","v":0},{"$f":"COUNTIF($AJ$5:$AJ$52,\"V2\")","v":0},{"$f":"COUNTIF($AJ$5:$AJ$52,\"V1\")","v":0},0,0,0,{"$f":"(BH35*5)+(BI35*4)+(BJ35*3)+(BK35*2)+(BL35*1)+SUM(AJ$5:AJ$52)","v":0},0,"",{"$f":"IF(BM35=0,\"\",31)","v":""},""]
[32,{"$f":"IF('Naam invoer'!E35=\"\",\"\",'Naam invoer'!E35)","v":""},{"$f":"IF('Naam invoer'!C35=\"\",\"\",'Naam invoer'!C35)","v":""},{"$f":"IF('Naam invoer'!D35=\"\",\"\",'Naam invoer'!D35)","v":""},{"$f":"IF('Naam invoer'!$B$32=\"\",\"\",'Naam invoer'!$B$32)","v":""},null,null,null,null,null,null,null,null,null,null,null,null,null,null,null,null,null,null,null,null,null,null,null,null,null,null,null,null,null,null,null,null,null,null,null,null,null,null,null,null,null,null,null,null,null,null,null,null,null,{"$f":"COUNTIF(F36:BA36,\"V\")","v":0},{"$f":"COUNTIF(F36:BA36,\"V4\")","v":0},{"$f":"COUNTIF(F36:BA36,\"V3\")","v":0},{"$f":"COUNTIF(F36:BA36,\"V2\")","v":0},{"$f":"COUNTIF(F36:BA36,\"V1\")","v":0},{"$f":"COUNTIF($AK$5:$AK$52,\"V\")","v":0},{"$f":"COUNTIF($AK$5:$AK$52,\"V4\")","v":0},{"$f":"COUNTIF($AK$5:$AK$52,\"V3\")","v":0},{"$f":"COUNTIF($AK$5:$AK$52,\"V2\")","v":0},{"$f":"COUNTIF($AK$5:$AK$52,\"V1\")","v":0},0,0,0,{"$f":"(BH36*5)+(BI36*4)+(BJ36*3)+(BK36*2)+(BL36*1)+SUM(AK$5:AK$52)","v":0},0,"",{"$f":"IF(BM36=0,\"\",32)","v":""},""]
[33,{"$f":"IF('Naam invoer'!E36=\"\",\"\",'Naam invoer'!E36)","v":""},{"$f":"IF('Naam invoer'!C36=\"\",\"\",'Naam invoer'!C36)","v":""},{"$f":"IF('Naam invoer'!D36=\"\",\"\",'Naam invoer'!D36)","v":""},{"$f":"IF('Naam invoer'!$B$36=\"\",\"\",'Naam invoer'!$B$36)","v":""},null,null,null,null,null,null,null,null,null,null,null,null,null,null,null,null,null,null,null,null,null,null,null,null,null,null,null,null,null,null,null,null,null,null,null,null,null,null,null,null,null,null,null,null,null,null,null,null,null,{"$f":"COUNTIF(F37:BA37,\"V\")","v":0},{"$f":"COUNTIF(F37:BA37,\"V4\")","v":0},{"$f":"COUNTIF(F37:BA37,\"V3\")","v":0},{"$f":"COUNTIF(F37:BA37,\"V2\")","v":0},{"$f":"COUNTIF(F37:BA37,\"V1\")","v":0},{"$f":"COUNTIF($AL$5:$AL$52,\"V\")","v":0},{"$f":"COUNTIF($AL$5:$AL$52,\"V4\")","v":0},{"$f":"COUNTIF($AL$5:$AL$52,\"V3\")","v":0},{"$f":"COUNTIF($AL$5:$AL$52,\"V2\")","v":0},{"$f":"COUNTIF($AL$5:$AL$52,\"V1\")","v":0},0,0,0,{"$f":"(BH37*5)+(BI37*4)+(BJ37*3)+(BK37*2)+(BL37*1)+SUM(AL$5:AL$52)","v":0},0,"",{"$f":"IF(BM37=0,\"\",33)","v":""},""]
[34,{"$f":"IF('Naam invoer'!E37=\"\",\"\",'Naam invoer'!E37)","v":""},{"$f":"IF('Naam invoer'!C37=\"\",\"\",'Naam invoer'!C37)","v":""},{"$f":"IF('Naam invoer'!D37=\"\",\"\",'Naam invoer'!D37)","v":""},{"$f":"IF('Naam invoer'!$B$36=\"\",\"\",'Naam invoer'!$B$36)","v":""},null,null,null,null,null,null,null,null,null,null,null,null,null,null,null,null,null,null,null,null,null,null,null,null,null,null,null,null,null,null,null,null,null,null,null,null,null,null,null,null,null,null,null,null,null,null,null,null,null,{"$f":"COUNTIF(F38:BA38,\"V\")","v":0},{"$f":"COUNTIF(F38:BA38,\"V4\")","v":0},{"$f":"COUNTIF(F38:BA38,\"V3\")","v":0},{"$f":"COUNTIF(F38:BA38,\"V2\")","v":0},{"$f":"COUNTIF(F38:BA38,\"V1\")","v":0},{"$f":"COUNTIF($AM$5:$AM$52,\"V\")","v":0},{"$f":"COUNTIF($AM$5:$AM$52,\"V4\")","v":0},{"$f":"COUNTIF($AM$5:$AM$52,\"V3\")","v":0},{"$f":"COUNTIF($AM$5:$AM$52,\"V2\")","v":0},{"$f":"COUNTIF($AM$5:$AM$52,\"V1\")","v":0},0,0,0,{"$f":"(BH38*5)+(BI38*4)+(BJ38*3)+(BK38*2)+(BL38*1)+SUM(AM$5:AM$52)","v":0},0,"",{"$f":"IF(BM38=0,\"\",34)","v":""},""]
[35,{"$f":"IF('Naam invoer'!E38=\"\",\"\",'Naam invoer'!E38)","v":""},{"$f":"IF('Naam invoer'!C38=\"\",\"\",'Naam invoer'!C38)","v":""},{"$f":"IF('Naam invoer'!D38=\"\",\"\",'Naam invoer'!D38)","v":""},{"$f":"IF('Naam invoer'!$B$36=\"\",\"\",'Naam invoer'!$B$36)","v":""},null,null,null,null,null,null,null,null,null,null,null,null,null,null,null,null,null,null,null,null,null,null,null,null,null,null,null,null,null,null,null,null,null,null,null,null,null,null,null,null,null,null,null,null,null,null,null,null,null,{"$f":"COUNTIF(F39:BA39,\"V\")","v":0},{"$f":"COUNTIF(F39:BA39,\"V4\")","v":0},{"$f":"COUNTIF(F39:BA39,\"V3\")","v":0},{"$f":"COUNTIF(F39:BA39,\"V2\")","v":0},{"$f":"COUNTIF(F39:BA39,\"V1\")","v":0},{"$f":"COUNTIF($AN$5:$AN$52,\"V\")","v":0},{"$f":"COUNTIF($AN$5:$AN$52,\"V4\")","v":0},{"$f":"COUNTIF($AN$5:$AN$52,\"V3\")","v":0},{"$f":"COUNTIF($AN$5:$AN$52,\"V2\")","v":0},{"$f":"COUNTIF($AN$5:$AN$52,\"V1\")","v":0},0,0,0,{"$f":"(BH39*5)+(BI39*4)+(BJ39*3)+(BK39*2)+(BL39*1)+SUM(AN$5:AN$52)","v":0},0,"",{"$f":"IF(BM39=0,\"\",35)","v":""},""]
[36,{"$f":"IF('Naam invoer'!E39=\"\",\"\",'Naam invoer'!E39)","v":""},{"$f":"IF('Naam invoer'!C39=\"\",\"\",'Naam invoer'!C39)","v":""},{"$f":"IF('Naam invoer'!D39=\"\",\"\",'Naam invoer'!D39)","v":""},{"$f":"IF('Naam invoer'!$B$36=\"\",\"\",'Naam invoer'!$B$36)","v":""},null,null,null,null,null,null,null,null,null,null,null,null,null,null,null,null,null,null,null,null,null,null,null,null,null,null,null,null,null,null,null,null,null,null,null,null,null,null,null,null,null,null,null,null,null,null,null,null,null,{"$f":"COUNTIF(F40:BA40,\"V\")","v":0},{"$f":"COUNTIF(F40:BA40,\"V4\")","v":0},{"$f":"COUNTIF(F40:BA40,\"V3\")","v":0},{"$f":"COUNTIF(F40:BA40,\"V2\")","v":0},{"$f":"COUNTIF(F40:BA40,\"V1\")","v":0},{"$f":"COUNTIF($AO$5:$AO$52,\"V\")","v":0},{"$f":"COUNTIF($AO$5:$AO$52,\"V4\")","v":0},{"$f":"COUNTIF($AO$5:$AO$52,\"V3\")","v":0},{"$f":"COUNTIF($AO$5:$AO$52,\"V2\")","v":0},{"$f":"COUNTIF($AO$5:$AO$52,\"V1\")","v":0},0,0,0,{"$f":"(BH40*5)+(BI40*4)+(BJ40*3)+(BK40*2)+(BL40*1)+SUM(AO$5:AO$52)","v":0},0,"",{"$f":"IF(BM40=0,\"\",36)","v":""},""]
[37,{"$f":"IF('Naam invoer'!E40=\"\",\"\",'Naam invoer'!E40)","v":""},{"$f":"IF('Naam invoer'!C40=\"\",\"\",'Naam invoer'!C40)","v":""},{"$f":"IF('Naam invoer'!D40=\"\",\"\",'Naam invoer'!D40)","v":""},{"$f":"IF('Naam invoer'!$B$40=\"\",\"\",'Naam invoer'!$B$40)","v":""},null,null,null,null,null,null,null,null,null,null,null,null,null,null,null,null,null,null,null,null,null,null,null,null,null,null,null,null,null,null,null,null,null,null,null,null,null,null,null,null,null,null,null,null,null,null,null,null,null,{"$f":"COUNTIF(F41:BA41,\"V\")","v":0},{"$f":"COUNTIF(F41:BA41,\"V4\")","v":0},{"$f":"COUNTIF(F41:BA41,\"V3\")","v":0},{"$f":"COUNTIF(F41:BA41,\"V2\")","v":0},{"$f":"COUNTIF(F41:BA41,\"V1\")","v":0},{"$f":"COUNTIF($AP$5:$AP$52,\"V\")","v":0},{"$f":"COUNTIF($AP$5:$AP$52,\"V4\")","v":0},{"$f":"COUNTIF($AP$5:$AP$52,\"V3\")","v":0},{"$f":"COUNTIF($AP$5:$AP$52,\"V2\")","v":0},{"$f":"COUNTIF($AP$5:$AP$52,\"V1\")","v":0},0,0,0,{"$f":"(BH41*5)+(BI41*4)+(BJ41*3)+(BK41*2)+(BL41*1)+SUM(AP$5:AP$52)","v":0},0,"",{"$f":"IF(BM41=0,\"\",37)","v":""},""]
[38,{"$f":"IF('Naam invoer'!E41=\"\",\"\",'Naam invoer'!E41)","v":""},{"$f":"IF('Naam invoer'!C41=\"\",\"\",'Naam invoer'!C41)","v":""},{"$f":"IF('Naam invoer'!D41=\"\",\"\",'Naam invoer'!D41)","v":""},{"$f":"IF('Naam invoer'!$B$40=\"\",\"\",'Naam invoer'!$B$40)","v":""},null,null,null,null,null,null,null,null,null,null,null,null,null,null,null,null,null,null,null,null,null,null,null,null,null,null,null,null,null,null,null,null,null,null,null,null,null,null,null,null,null,null,null,null,null,null,null,null,null,{"$f":"COUNTIF(F42:BA42,\"V\")","v":0},{"$f":"COUNTIF(F42:BA42,\"V4\")","v":0},{"$f":"COUNTIF(F42:BA42,\"V3\")","v":0},{"$f":"COUNTIF(F42:BA42,\"V2\")","v":0},{"$f":"COUNTIF(F42:BA42,\"V1\")","v":0},{"$f":"COUNTIF($AQ$5:$AQ$52,\"V\")","v":0},{"$f":"COUNTIF($AQ$5:$AQ$52,\"V4\")","v":0},{"$f":"COUNTIF($AQ$5:$AQ$52,\"V3\")","v":0},{"$f":"COUNTIF($AQ$5:$AQ$52,\"V2\")","v":0},{"$f":"COUNTIF($AQ$5:$AQ$52,\"V1\")","v":0},0,0,0,{"$f":"(BH42*5)+(BI42*4)+(BJ42*3)+(BK42*2)+(BL42*1)+SUM(AQ$5:AQ$52)","v":0},0,"",{"$f":"IF(BM42=0,\"\",38)","v":""},""]
[39,{"$f":"IF('Naam invoer'!E42=\"\",\"\",'Naam invoer'!E42)","v":""},{"$f":"IF('Naam invoer'!C42=\"\",\"\",'Naam invoer'!C42)","v":""},{"$f":"IF('Naam invoer'!D42=\"\",\"\",'Naam invoer'!D42)","v":""},{"$f":"IF('Naam invoer'!$B$40=\"\",\"\",'Naam invoer'!$B$40)","v":""},null,null,null,null,null,null,null,null,null,null,null,null,null,null,null,null,null,null,null,null,null,null,null,null,null,null,null,null,null,null,null,null,null,null,null,null,null,null,null,null,null,null,null,null,null,null,null,null,null,{"$f":"COUNTIF(F43:BA43,\"V\")","v":0},{"$f":"COUNTIF(F43:BA43,\"V4\")","v":0},{"$f":"COUNTIF(F43:BA43,\"V3\")","v":0},{"$f":"COUNTIF(F43:BA43,\"V2\")","v":0},{"$f":"COUNTIF(F43:BA43,\"V1\")","v":0},{"$f":"COUNTIF($AR$5:$AR$52,\"V\")","v":0},{"$f":"COUNTIF($AR$5:$AR$52,\"V4\")","v":0},{"$f":"COUNTIF($AR$5:$AR$52,\"V3\")","v":0},{"$f":"COUNTIF($AR$5:$AR$52,\"V2\")","v":0},{"$f":"COUNTIF($AR$5:$AR$52,\"V1\")","v":0},0,0,0,{"$f":"(BH43*5)+(BI43*4)+(BJ43*3)+(BK43*2)+(BL43*1)+SUM(AR$5:AR$52)","v":0},0,"",{"$f":"IF(BM43=0,\"\",39)","v":""},""]
[40,{"$f":"IF('Naam invoer'!E43=\"\",\"\",'Naam invoer'!E43)","v":""},{"$f":"IF('Naam invoer'!C43=\"\",\"\",'Naam invoer'!C43)","v":""},{"$f":"IF('Naam invoer'!D43=\"\",\"\",'Naam invoer'!D43)","v":""},{"$f":"IF('Naam invoer'!$B$40=\"\",\"\",'Naam invoer'!$B$40)","v":""},null,null,null,null,null,null,null,null,null,null,null,null,null,null,null,null,null,null,null,null,null,null,null,null,null,null,null,null,null,null,null,null,null,null,null,null,null,null,null,null,null,null,null,null,null,null,null,null,null,{"$f":"COUNTIF(F44:BA44,\"V\")","v":0},{"$f":"COUNTIF(F44:BA44,\"V4\")","v":0},{"$f":"COUNTIF(F44:BA44,\"V3\")","v":0},{"$f":"COUNTIF(F44:BA44,\"V2\")","v":0},{"$f":"COUNTIF(F44:BA44,\"V1\")","v":0},{"$f":"COUNTIF($AS$5:$AS$52,\"V\")","v":0},{"$f":"COUNTIF($AS$5:$AS$52,\"V4\")","v":0},{"$f":"COUNTIF($AS$5:$AS$52,\"V3\")","v":0},{"$f":"COUNTIF($AS$5:$AS$52,\"V2\")","v":0},{"$f":"COUNTIF($AS$5:$AS$52,\"V1\")","v":0},0,0,0,{"$f":"(BH44*5)+(BI44*4)+(BJ44*3)+(BK44*2)+(BL44*1)+SUM(AS$5:AS$52)","v":0},0,"",{"$f":"IF(BM44=0,\"\",40)","v":""},""]
[41,{"$f":"IF('Naam invoer'!E44=\"\",\"\",'Naam invoer'!E44)","v":""},{"$f":"IF('Naam invoer'!C44=\"\",\"\",'Naam invoer'!C44)","v":""},{"$f":"IF('Naam invoer'!D44=\"\",\"\",'Naam invoer'!D44)","v":""},{"$f":"IF('Naam invoer'!$B$44=\"\",\"\",'Naam invoer'!$B$44)","v":""},null,null,null,null,null,null,null,null,null,null,null,null,null,null,null,null,null,null,null,null,null,null,null,null,null,null,null,null,null,null,null,null,null,null,null,null,null,null,null,null,null,null,null,null,null,null,null,null,null,{"$f":"COUNTIF(F45:BA45,\"V\")","v":0},{"$f":"COUNTIF(F45:BA45,\"V4\")","v":0},{"$f":"COUNTIF(F45:BA45,\"V3\")","v":0},{"$f":"COUNTIF(F45:BA45,\"V2\")","v":0},{"$f":"COUNTIF(F45:BA45,\"V1\")","v":0},{"$f":"COUNTIF($AT$5:$AT$52,\"V\")","v":0},{"$f":"COUNTIF($AT$5:$AT$52,\"V4\")","v":0},{"$f":"COUNTIF($AT$5:$AT$52,\"V3\")","v":0},{"$f":"COUNTIF($AT$5:$AT$52,\"V2\")","v":0},{"$f":"COUNTIF($AT$5:$AT$52,\"V1\")","v":0},0,0,0,{"$f":"(BH45*5)+(BI45*4)+(BJ45*3)+(BK45*2)+(BL45*1)+SUM(AT$5:AT$52)","v":0},0,"",{"$f":"IF(BM45=0,\"\",41)","v":""},""]
[42,{"$f":"IF('Naam invoer'!E45=\"\",\"\",'Naam invoer'!E45)","v":""},{"$f":"IF('Naam invoer'!C45=\"\",\"\",'Naam invoer'!C45)","v":""},{"$f":"IF('Naam invoer'!D45=\"\",\"\",'Naam invoer'!D45)","v":""},{"$f":"IF('Naam invoer'!$B$44=\"\",\"\",'Naam invoer'!$B$44)","v":""},null,null,null,null,null,null,null,null,null,null,null,null,null,null,null,null,null,null,null,null,null,null,null,null,null,null,null,null,null,null,null,null,null,null,null,null,null,null,null,null,null,null,null,null,null,null,null,null,null,{"$f":"COUNTIF(F46:BA46,\"V\")","v":0},{"$f":"COUNTIF(F46:BA46,\"V4\")","v":0},{"$f":"COUNTIF(F46:BA46,\"V3\")","v":0},{"$f":"COUNTIF(F46:BA46,\"V2\")","v":0},{"$f":"COUNTIF(F46:BA46,\"V1\")","v":0},{"$f":"COUNTIF($AU$5:$AU$52,\"V\")","v":0},{"$f":"COUNTIF($AU$5:$AU$52,\"V4\")","v":0},{"$f":"COUNTIF($AU$5:$AU$52,\"V3\")","v":0},{"$f":"COUNTIF($AU$5:$AU$52,\"V2\")","v":0},{"$f":"COUNTIF($AU$5:$AU$52,\"V1\")","v":0},0,0,0,{"$f":"(BH46*5)+(BI46*4)+(BJ46*3)+(BK46*2)+(BL46*1)+SUM(AU$5:AU$52)","v":0},0,"",{"$f":"IF(BM46=0,\"\",42)","v":""},""]
[43,{"$f":"IF('Naam invoer'!E46=\"\",\"\",'Naam invoer'!E46)","v":""},{"$f":"IF('Naam invoer'!C46=\"\",\"\",'Naam invoer'!C46)","v":""},{"$f":"IF('Naam invoer'!D46=\"\",\"\",'Naam invoer'!D46)","v":""},{"$f":"IF('Naam invoer'!$B$44=\"\",\"\",'Naam invoer'!$B$44)","v":""},null,null,null,null,null,null,null,null,null,null,null,null,null,null,null,null,null,null,null,null,null,null,null,null,null,null,null,null,null,null,null,null,null,null,null,null,null,null,null,null,null,null,null,null,null,null,null,null,null,{"$f":"COUNTIF(F47:BA47,\"V\")","v":0},{"$f":"COUNTIF(F47:BA47,\"V4\")","v":0},{"$f":"COUNTIF(F47:BA47,\"V3\")","v":0},{"$f":"COUNTIF(F47:BA47,\"V2\")","v":0},{"$f":"COUNTIF(F47:BA47,\"V1\")","v":0},{"$f":"COUNTIF($AV$5:$AV$52,\"V\")","v":0},{"$f":"COUNTIF($AV$5:$AV$52,\"V4\")","v":0},{"$f":"COUNTIF($AV$5:$AV$52,\"V3\")","v":0},{"$f":"COUNTIF($AV$5:$AV$52,\"V2\")","v":0},{"$f":"COUNTIF($AV$5:$AV$52,\"V1\")","v":0},0,0,0,{"$f":"(BH47*5)+(BI47*4)+(BJ47*3)+(BK47*2)+(BL47*1)+SUM(AV$5:AV$52)","v":0},0,"",{"$f":"IF(BM47=0,\"\",43)","v":""},""]
[44,{"$f":"IF('Naam invoer'!E47=\"\",\"\",'Naam invoer'!E47)","v":""},{"$f":"IF('Naam invoer'!C47=\"\",\"\",'Naam invoer'!C47)","v":""},{"$f":"IF('Naam invoer'!D47=\"\",\"\",'Naam invoer'!D47)","v":""},{"$f":"IF('Naam invoer'!$B$44=\"\",\"\",'Naam invoer'!$B$44)","v":""},null,null,null,null,null,null,null,null,null,null,null,null,null,null,null,null,null,null,null,null,null,null,null,null,null,null,null,null,null,null,null,null,null,null,null,null,null,null,null,null,null,null,null,null,null,null,null,null,null,{"$f":"COUNTIF(F48:BA48,\"V\")","v":0},{"$f":"COUNTIF(F48:BA48,\"V4\")","v":0},{"$f":"COUNTIF(F48:BA48,\"V3\")","v":0},{"$f":"COUNTIF(F48:BA48,\"V2\")","v":0},{"$f":"COUNTIF(F48:BA48,\"V1\")","v":0},{"$f":"COUNTIF($AW$5:$AW$52,\"V\")","v":0},{"$f":"COUNTIF($AW$5:$AW$52,\"V4\")","v":0},{"$f":"COUNTIF($AW$5:$AW$52,\"V3\")","v":0},{"$f":"COUNTIF($AW$5:$AW$52,\"V2\")","v":0},{"$f":"COUNTIF($AW$5:$AW$52,\"V1\")","v":0},0,0,0,{"$f":"(BH48*5)+(BI48*4)+(BJ48*3)+(BK48*2)+(BL48*1)+SUM(AW$5:AW$52)","v":0},0,"",{"$f":"IF(BM48=0,\"\",44)","v":""},""]
[45,{"$f":"IF('Naam invoer'!E48=\"\",\"\",'Naam invoer'!E48)","v":""},{"$f":"IF('Naam invoer'!C48=\"\",\"\",'Naam invoer'!C48)","v":""},{"$f":"IF('Naam invoer'!D48=\"\",\"\",'Naam invoer'!D48)","v":""},{"$f":"IF('Naam invoer'!$B$48=\"\",\"\",'Naam invoer'!$B$48)","v":""},null,null,null,null,null,null,null,null,null,null,null,null,null,null,null,null,null,null,null,null,null,null,null,null,null,null,null,null,null,null,null,null,null,null,null,null,null,null,null,null,null,null,null,null,null,null,null,null,null,{"$f":"COUNTIF(F49:BA49,\"V\")","v":0},{"$f":"COUNTIF(F49:BA49,\"V4\")","v":0},{"$f":"COUNTIF(F49:BA49,\"V3\")","v":0},{"$f":"COUNTIF(F49:BA49,\"V2\")","v":0},{"$f":"COUNTIF(F49:BA49,\"V1\")","v":0},{"$f":"COUNTIF($AX$5:$AX$52,\"V\")","v":0},{"$f":"COUNTIF($AX$5:$AX$52,\"V4\")","v":0},{"$f":"COUNTIF($AX$5:$AX$52,\"V3\")","v":0},{"$f":"COUNTIF($AX$5:$AX$52,\"V2\")","v":0},{"$f":"COUNTIF($AX$5:$AX$52,\"V1\")","v":0},0,0,0,{"$f":"(BH49*5)+(BI49*4)+(BJ49*3)+(BK49*2)+(BL49*1)+SUM(AX$5:AX$52)","v":0},0,"",{"$f":"IF(BM49=0,\"\",45)","v":""},""]
[46,{"$f":"IF('Naam invoer'!E49=\"\",\"\",'Naam invoer'!E49)","v":""},{"$f":"IF('Naam invoer'!C49=\"\",\"\",'Naam invoer'!C49)","v":""},{"$f":"IF('Naam invoer'!D49=\"\",\"\",'Naam invoer'!D49)","v":""},{"$f":"IF('Naam invoer'!$B$48=\"\",\"\",'Naam invoer'!$B$48)","v":""},null,null,null,null,null,null,null,null,null,null,null,null,null,null,null,null,null,null,null,null,null,null,null,null,null,null,null,null,null,null,null,null,null,null,null,null,null,null,null,null,null,null,null,null,null,null,null,null,null,{"$f":"COUNTIF(F50:BA50,\"V\")","v":0},{"$f":"COUNTIF(F50:BA50,\"V4\")","v":0},{"$f":"COUNTIF(F50:BA50,\"V3\")","v":0},{"$f":"COUNTIF(F50:BA50,\"V2\")","v":0},{"$f":"COUNTIF(F50:BA50,\"V1\")","v":0},{"$f":"COUNTIF($AY$5:$AY$52,\"V\")","v":0},{"$f":"COUNTIF($AY$5:$AY$52,\"V4\")","v":0},{"$f":"COUNTIF($AY$5:$AY$52,\"V3\")","v":0},{"$f":"COUNTIF($AY$5:$AY$52,\"V2\")","v":0},{"$f":"COUNTIF($AY$5:$AY$52,\"V1\")","v":0},0,0,0,{"$f":"(BH50*5)+(BI50*4)+(BJ50*3)+(BK50*2)+(BL50*1)+SUM(AY$5:AY$52)","v":0},0,"",{"$f":"IF(BM50=0,\"\",46)","v":""},""]
[47,{"$f":"IF('Naam invoer'!E50=\"\",\"\",'Naam invoer'!E50)","v":""},{"$f":"IF('Naam invoer'!C50=\"\",\"\",'Naam invoer'!C50)","v":""},{"$f":"IF('Naam invoer'!D50=\"\",\"\",'Naam invoer'!D50)","v":""},{"$f":"IF('Naam invoer'!$B$48=\"\",\"\",'Naam invoer'!$B$48)","v":""},null,null,null,null,null,null,null,null,null,null,null,null,null,null,null,null,null,null,null,null,null,null,null,null,null,null,null,null,null,null,null,null,null,null,null,null,null,null,null,null,null,null,null,null,null,null,null,null,null,{"$f":"COUNTIF(F51:BA51,\"V\")","v":0},{"$f":"COUNTIF(F51:BA51,\"V4\")","v":0},{"$f":"COUNTIF(F51:BA51,\"V3\")","v":0},{"$f":"COUNTIF(F51:BA51,\"V2\")","v":0},{"$f":"COUNTIF(F51:BA51,\"V1\")","v":0},{"$f":"COUNTIF($AZ$5:$AZ$52,\"V\")","v":0},{"$f":"COUNTIF($AZ$5:$AZ$52,\"V4\")","v":0},{"$f":"COUNTIF($AZ$5:$AZ$52,\"V3\")","v":0},{"$f":"COUNTIF($AZ$5:$AZ$52,\"V2\")","v":0},{"$f":"COUNTIF($AZ$5:$AZ$52,\"V1\")","v":0},0,0,0,{"$f":"(BH51*5)+(BI51*4)+(BJ51*3)+(BK51*2)+(BL51*1)+SUM(AZ$5:AZ$52)","v":0},0,"",{"$f":"IF(BM51=0,\"\",47)","v":""},""]
[48,{"$f":"IF('Naam invoer'!E51=\"\",\"\",'Naam invoer'!E51)","v":""},{"$f":"IF('Naam invoer'!C51=\"\",\"\",'Naam invoer'!C51)","v":""},{"$f":"IF('Naam invoer'!D51=\"\",\"\",'Naam invoer'!D51)","v":""},{"$f":"IF('Naam invoer'!$B$48=\"\",\"\",'Naam invoer'!$B$48)","v":""},null,null,null,null,null,null,null,null,null,null,null,null,null,null,null,null,null,null,null,null,null,null,null,null,null,null,null,null,null,null,null,null,null,null,null,null,null,null,null,null,null,null,null,null,null,null,null,null,null,{"$f":"COUNTIF(F52:BA52,\"V\")","v":0},{"$f":"COUNTIF(F52:BA52,\"V4\")","v":0},{"$f":"COUNTIF(F52:BA52,\"V3\")","v":0},{"$f":"COUNTIF(F52:BA52,\"V2\")","v":0},{"$f":"COUNTIF(F52:BA52,\"V1\")","v":0},{"$f":"COUNTIF($BA$5:$BA$52,\"V\")","v":0},{"$f":"COUNTIF($BA$5:$BA$52,\"V4\")","v":0},{"$f":"COUNTIF($BA$5:$BA$52,\"V3\")","v":0},{"$f":"COUNTIF($BA$5:$BA$52,\"V2\")","v":0},{"$f":"COUNTIF($BA$5:$BA$52,\"V1\")","v":0},0,0,0,{"$f":"(BH52*5)+(BI52*4)+(BJ52*3)+(BK52*2)+(BL52*1)+SUM(BA$5:BA$52)","v":0},0,"",{"$f":"IF(BM52=0,\"\",48)","v":""},""]
[]
[null,"In te vullen waarden: V, V4, V3, V2, V1, 4, 3, 2, 1, 0.",null,null,null,null,null,null,null,null,null,null,null,null,null,null,null,null,null,null,null,null,null,null,null,null,null,null,null,null,null,null,null,null,null,null,null,null,null,null,null,null,null,null,null,null,null,null,null,null,null,null,null,null,null,null,null,null,null,null,null,null,null,{"$f":"SUM(BN5:BN52)","v":90},null,null,{"$f":"SUM(BO5:BO52)","v":665},{"$f":"SUM(BP5:BP52)","v":665},{"$f":"BO54-BP54","v":0}]
[null,"Geen spaties gebruiken."]
[null,null,null,null,null,null,null,null,null,null,null,null,null,null,null,null,null,null,null,null,null,null,null,null,null,null,null,null,null,null,null,null,null,null,null,null,null,null,null,null,null,null,null,null,null,null,null,null,null,null,null,null,null,null,null,null,null,null,null,null,null,null,null,null,null,{"$f":"V1","v":90},"rode cijfers moeten gelijk zijn"]
[null,"Voor einduitslag  type Ctrl i",null,null,null,null,null,null,null,null,null,null,null,null,null,null,null,null,null,null,null,null,null,null,null,null,null,null,null,null,null,null,null,null,null,null,null,null,null,null,null,null,null,null,null,null,null,null,null,null,null,null,null,null,null,null,null,null,null,null,null,null,null,null,null,{"$f":"X1","v":90}]